{"text_format":"3","workbook":"xlsx","n_sheets":7,"sheets":["Données","Calculs","Table Paliers","Azote Résiduel","Majoration","Oxygene","Remontée"],"not_rendered":{"images":2,"macros":1,"defined_names":37,"comments":1},"read":"whole","date_system":"1900"}

{"sheet":"Données","index":0,"n_rows":31,"n_cols":9,"rows_kept":31,"merged":[[1,1,31,1],[1,2,1,8],[1,9,31,9],[2,2,3,8],[4,2,4,8],[5,5,24,5],[5,6,5,8],[6,6,6,8],[7,6,7,8],[9,2,9,4],[10,6,10,7],[12,2,12,3],[13,6,13,8],[15,2,15,4],[20,2,20,4],[20,6,20,8],[25,2,25,8],[26,2,28,2],[26,3,28,7],[26,8,28,8],[29,2,29,8],[30,2,30,3],[30,4,30,6],[30,7,30,8]]}
[]
[]
[null,null,"ATTENTION : Ces calculs (base MN90 et PPO2 max 1,6)\nne concernent que les plongées réalisées au niveau de la mer \net hors plongées avec accident de remontée."]
[]
[]
[null,null,"1ere Plong","Nitrox","2eme Plong",null,"S E C O N D E      P L O N G E E"]
[null,null,{"$f":"_Nit1","v":"Air"},"<=%Oxy=>",{"$f":"_Nit2","v":"Air"},null,{"$f":"TypePlongee","v":""}]
[null,null,{"$f":"ProEqui1","v":""},"Prof Equiv",{"$f":"ProEqui2","v":""},null,"D O N N E E S      S A I S I E S"]
[null,null,{"$f":"ProMax1","v":{"v":65,"d":"65 m"}},"Prof Max",{"$f":"ProMax2","v":{"v":65,"d":"65 m"}},null,"Prof Maxi","Durée en mn","Heure début"]
[null,null,"P R E M I E R E      P L O N G E E"]
[null,null,"Prof Maxi","Durée en mn","Heure début",null,"Consommation moyenne :",null,{"$f":"Conso2","v":{"v":20,"d":" 20 l/min"}}]
[{"$nulls":6},"Volume bloc","Pression Ini","Restera"]
[null,null,"Consommation moyenne :",null,{"$f":"Conso1","v":{"v":20,"d":" 20 l/min"}},null,{"v":12,"d":"12.0 litres"},{"v":200,"d":"200 bar"},{"$f":"Pres_Fin_2","v":{"v":200,"d":"200 bar"}}]
[null,null,"Volume bloc","Pression Ini","Restera",null,"D O N N E E S      R E S T I T U E E S"]
[null,null,{"v":12,"d":"12.0 litres"},{"v":200,"d":"200 bar"},{"$f":"Pres_Fin_1","v":{"v":200,"d":"200 bar"}},null,"Intervalle","Majoration","Durée Majorée"]
[null,null,"D O N N E E S      R E S T I T U E E S",{"$nulls":3},{"$f":"Intervalle","v":""},{"$f":"Majoration!F7","v":""},{"$f":"Calculs!F17","v":""}]
[null,null,"Durée Plongée","Remontée","Paliers",null,"Durée Plongée","Remontée","Paliers"]
[null,null,{"$f":"Calculs!E8","v":""},{"$f":"Calculs!F8","v":""},{"$f":"Calculs!G8","v":""},null,{"$f":"Calculs!H17","v":""},{"$f":"Calculs!I17","v":""},{"$f":"Calculs!J17","v":""}]
[null,null,"Prof corrigée","Durée Corrigée","Heure sortie",null,"Prof corrigée","Durée Corrigée","Heure sortie"]
[null,null,{"$f":"Calculs!B11","v":""},{"$f":"Calculs!C11","v":""},{"$f":"Calculs!I8","v":""},null,{"$f":"Calculs!B20","v":""},{"$f":"Calculs!C20","v":""},{"$f":"Calculs!L17","v":""}]
{"$rows_left_out":12}
{"sheet":"Calculs","index":1,"n_rows":329,"n_cols":15,"rows_kept":329,"hidden":true,"merged":[[1,1,3,5],[5,1,5,8],[8,1,8,8],[14,1,14,11],[17,1,17,10],[18,3,18,4],[19,3,19,4],[21,5,21,6],[27,1,27,2]]}
[]
[null,"NE PAS MODIFIER CES TABLEAUX"]
[]
[]
[]
[null,"P A R A M E T R E S      D E      L A      P R E M I E R E      P L O N G E E",{"$nulls":7},"Conso",20]
[null,"Prof Maxi","Durée en mn","Heure début","Durée Plongée","Remontée","Paliers","Durée Totale","Heure sortie","Volume bloc","Pression ini","Volume Ini"]
[null,{"$f":"IF(Données!C12=\"\",\"\",ProEqui1)","v":""},{"$f":"IF(Données!D12=\"\",\"\",Données!D12)","v":""},{"$f":"IF(Données!E12=\"\",\"\",Données!E12)","v":""},{"$f":"IF(_Dur1=\"\",\"\",_Dur1/1440)","v":""},{"$f":"IF(Prof1=\"\",\"\",Remontée!$E$7)","v":""},{"$f":"IF(SUM($D$11:$H$11)=0,\"\",SUM($D$11:$H$11))","v":""},{"$f":"IF(SUM($E$8:$G$8)=0,\"\",SUM($E$8:$G$8))","v":""},{"$f":"IF(OR(D8=\"\",H8=\"\"),\"\",HeureDeb1+SUM($E$8:$G$8))","v":""},{"$f":"Données!C15","v":{"v":12,"d":"12.0 litres"}},{"$f":"Données!D15","v":{"v":200,"d":"200 bar"}},{"$f":"Vol_Bloc_1*Pres_Bloc_1","v":{"v":2400,"d":"2400 litres"}}]
[null,"D O N N E E S      C O R R I G E E S      O U      R E S T I T U E E S",{"$nulls":7},"Plongee","Remontee","Total"]
[null,"Prof","Durée Corrigée","15 m","12 m","9 m","6 m","3 m","GPS",{"$f":"IF(OR(Prof1=\"\",_Dur1=\"\"),0,Conso1*C12*_Dur1)","v":{"v":0,"d":"0 litres"}},{"$f":"SUM(D12:I12)","v":{"v":0,"d":"0 litres"}},{"$f":"J10+K10","v":{"v":0,"d":"0 litres"}}]
[null,{"$f":"IF(Prof1=\"\",\"\",IF(Prof1<6,6,IF(ISERROR(INDEX('Table Paliers'!$L$6:$L$31,MATCH(B$8,'Table Paliers'!$L$6:$L$31,0))),INDEX('Table Paliers'!$L$6:$L$31,MATCH(B$8,'Table Paliers'!$L$6:$L$31,1)+1),INDEX('Table Paliers'!$L$6:$L$31,MATCH(B$8,'Table Paliers'!$L$6:$L$31,0)))))","v":""},{"$f":"IF(OR(_Dur1=\"\",Prof1=\"\"),\"\",IF(_Dur1>'Table Paliers'!$O$46,\"Interdit\",IF(ISERROR(INDEX('Table Paliers'!$O$6:$O$46,MATCH(_Dur1,'Table Paliers'!$O$6:$O$46,0))),INDEX('Table Paliers'!$O$6:$O$46,MATCH(_Dur1,'Table Paliers'!$O$6:$O$46,1)+1),INDEX('Table Paliers'!$O$6:$O$46,MATCH(_Dur1,'Table Paliers'!$O$6:$O$46,0)))))","v":""},{"$f":"IF(ISERROR(DGET('Table Paliers'!$B$6:$J$370,D$10,$B$10:$C$11)),\"\",DGET('Table Paliers'!$B$6:$J$370,D$10,$B$10:$C$11)/1440)","v":""},{"$f":"IF(ISERROR(DGET('Table Paliers'!$B$6:$J$370,E$10,$B$10:$C$11)),\"\",DGET('Table Paliers'!$B$6:$J$370,E$10,$B$10:$C$11)/1440)","v":""},{"$f":"IF(ISERROR(DGET('Table Paliers'!$B$6:$J$370,F$10,$B$10:$C$11)),\"\",DGET('Table Paliers'!$B$6:$J$370,F$10,$B$10:$C$11)/1440)","v":""},{"$f":"IF(ISERROR(DGET('Table Paliers'!$B$6:$J$370,G$10,$B$10:$C$11)),\"\",DGET('Table Paliers'!$B$6:$J$370,G$10,$B$10:$C$11)/1440)","v":""},{"$f":"IF(ISERROR(DGET('Table Paliers'!$B$6:$J$370,H$10,$B$10:$C$11)),\"\",DGET('Table Paliers'!$B$6:$J$370,H$10,$B$10:$C$11)/1440)","v":""},{"$f":"IF(ISERROR(DGET('Table Paliers'!$B$6:$J$370,I$10,$B$10:$C$11)),\"\",DGET('Table Paliers'!$B$6:$J$370,I$10,$B$10:$C$11))","v":""},"Reste",{"$f":"L8-L10","v":{"v":2400,"d":"2400 litres"}},{"$f":"INT(K11/Vol_Bloc_1)","v":{"v":200,"d":"200 bar"}}]
[null,"Pression",{"$f":"IF(Prof1=\"\",\"\",(Prof1+10)/10)","v":""},{"$f":"IF(D11=\"\",0,(Conso1*2.5)*MINUTE(D11))","v":{"v":0,"d":"0 litres"}},{"$f":"IF(E11=\"\",0,(Conso1*2.2)*MINUTE(E11))","v":{"v":0,"d":"0 litres"}},{"$f":"IF(F11=\"\",0,(Conso1*1.9)*MINUTE(F11))","v":{"v":0,"d":"0 litres"}},{"$f":"IF(G11=\"\",0,(Conso1*1.6)*MINUTE(G11))","v":{"v":0,"d":"0 litres"}},{"$f":"IF(H11=\"\",0,(Conso1*1.3)*MINUTE(H11))","v":{"v":0,"d":"0 litres"}},{"$f":"IF(F8=\"\",0,(Conso1*C12)*MINUTE(F8)/2)","v":{"v":0,"d":"0 litres"}}]
[]
[]
[null,"P A R A M E T R E S      D E      L A      S E C O N D E      P L O N G E E      ( C O N S E C U T I V E )",{"$nulls":10},"Volume bloc","Pression ini","Volume Ini"]
[null,"Prof Maxi","Durée en mn","Heure début","Majoration","Durée Majorée","Intervalle","Durée Plongée","Remontée","Paliers","Durée Totale","Heure sortie",{"$f":"Données!G13","v":{"v":12,"d":"12.0 litres"}},{"$f":"Données!H13","v":{"v":200,"d":"200 bar"}},{"$f":"Vol_Bloc_2*Pres_Bloc_2","v":{"v":2400,"d":"2400 litres"}}]
[null,{"$f":"IF(Données!G10=\"\",\"\",ProEqui2)","v":""},{"$f":"IF(Données!H10=\"\",\"\",Données!H10)","v":""},{"$f":"IF(Données!I10=\"\",\"\",Données!I10)","v":""},{"$f":"IF(ISERROR(B24),\"\",B24)","v":"00:00:00"},{"$f":"IF(ISERROR(C24),\"\",C24)","v":""},{"$f":"IF(ISERROR(D24),\"\",D24)","v":""},{"$f":"IF(OR(_Dur2=\"\",B17=\"\"),\"\",C17/1440)","v":""},{"$f":"IF(B17=\"\",\"\",Remontée!$E$10)","v":""},{"$f":"IF(SUM(F20:J20)=0,\"\",SUM(F20:J20))","v":""},{"$f":"IF(SUM(H17:J17)=0,\"\",SUM(H17:J17))","v":""},{"$f":"IF(OR(D17=\"\",K17=\"\",HeureDeb1=\"\"),\"\",HeureDeb2+K17)","v":""},"Plongee","Remontee","Total"]
[null,"D O N N E E S      C O R R I G E E S      O U      R E S T I T U E E S",{"$nulls":9},"Conso 2",{"$f":"IF(OR(Prof2=\"\",_Dur2=\"\"),0,Conso2*C21*_Dur2)","v":{"v":0,"d":"0 litres"}},{"$f":"SUM(F21:K21)","v":{"v":0,"d":"0 litres"}},{"$f":"M18+N18","v":{"v":0,"d":"0 litres"}}]
[null,"Prof","Durée Corrigée","Heure début corrigée",null,"15 m","12 m","9 m","6 m","3 m","GPS",20,"Reste",{"$f":"O16-O18","v":{"v":2400,"d":"2400 litres"}},{"$f":"INT(N19/Vol_Bloc_2)","v":{"v":200,"d":"200 bar"}}]
[null,{"$f":"IF($G$17<'Azote Résiduel'!$C$12,MAX(ProfC1,IF(ISERROR(INDEX('Table Paliers'!$L$6:$L$31,MATCH(B$17,'Table Paliers'!$L$6:$L$31,0))),INDEX('Table Paliers'!$L$6:$L$31,MATCH(B$17,'Table Paliers'!$L$6:$L$31,1)+1),INDEX('Table Paliers'!$L$6:$L$31,MATCH(B$17,'Table Paliers'!$L$6:$L$31,0)))),IF(B17=\"\",\"\",IF(ISERROR(INDEX('Table Paliers'!$L$6:$L$31,MATCH(B$17,'Table Paliers'!$L$6:$L$31,0))),INDEX('Table Paliers'!$L$6:$L$31,MATCH(B$17,'Table Paliers'!$L$6:$L$31,1)+1),INDEX('Table Paliers'!$L$6:$L$31,MATCH(B$17,'Table Paliers'!$L$6:$L$31,0)))))","v":""},{"$f":"IF(OR(_Dur2=\"\",Prof2=\"\",G17=\"Impossible\",G17=\"\"),\"\",IF($C$24>'Table Paliers'!$R$46,\"Interdit\",IF(ISERROR(INDEX('Table Paliers'!$R$6:$R$46,MATCH(C$24,'Table Paliers'!$R$6:$R$46,0))),INDEX('Table Paliers'!$R$6:$R$46,MATCH(C$24,'Table Paliers'!$R$6:$R$46,1)+1),INDEX('Table Paliers'!$R$6:$R$46,MATCH(C$24,'Table Paliers'!$R$6:$R$46,0)))))","v":""},{"$f":"IF(HeureDeb2<HeureDeb1,HeureDeb2+1,IF(HeureDeb2<HeureSortie1,\"Pas sorti\",HeureDeb2))","v":""},null,{"$f":"IF(ISERROR(DGET('Table Paliers'!$B$6:$J$370,D$10,$B$19:$C$20)),\"\",DGET('Table Paliers'!$B$6:$J$370,D$10,$B$19:$C$20)/1440)","v":""},{"$f":"IF(ISERROR(DGET('Table Paliers'!$B$6:$J$370,E$10,$B$19:$C$20)),\"\",DGET('Table Paliers'!$B$6:$J$370,E$10,$B$19:$C$20)/1440)","v":""},{"$f":"IF(ISERROR(DGET('Table Paliers'!$B$6:$J$370,F$10,$B$19:$C$20)),\"\",DGET('Table Paliers'!$B$6:$J$370,F$10,$B$19:$C$20)/1440)","v":""},{"$f":"IF(ISERROR(DGET('Table Paliers'!$B$6:$J$370,G$10,$B$19:$C$20)),\"\",DGET('Table Paliers'!$B$6:$J$370,G$10,$B$19:$C$20)/1440)","v":""},{"$f":"IF(ISERROR(DGET('Table Paliers'!$B$6:$J$370,H$10,$B$19:$C$20)),\"\",DGET('Table Paliers'!$B$6:$J$370,H$10,$B$19:$C$20)/1440)","v":""},{"$f":"IF(ISERROR(DGET('Table Paliers'!$B$6:$J$370,I$10,$B$19:$C$20)),\"\",DGET('Table Paliers'!$B$6:$J$370,I$10,$B$19:$C$20))","v":""}]
{"$rows_left_out":310}
{"sheet":"Table Paliers","index":2,"n_rows":382,"n_cols":18,"rows_kept":382,"hidden":true,"merged":[[1,1,3,9],[4,12,4,14],[4,15,4,17],[373,1,374,1],[373,2,374,9],[375,1,376,1],[375,2,376,9],[377,1,378,3],[377,4,378,9],[379,1,380,1],[379,2,380,9],[381,1,382,1],[381,2,382,9]]}
[]
[null,"NE PAS MODIFIER CES TABLEAUX"]
[]
[]
[{"$nulls":12},"Plongée 1",null,null,"Plongée 2"]
[null,"Prof","Durée Corrigée","15 m","12 m","9 m","6 m","3 m","DTR","GPS",null,"Profondeurs","Prof Maxi",null,"Durée selon Prof","Prof Maxi",null,"Durée selon Prof"]
[null,{"v":6,"d":"6 m"},{"v":15,"d":"15' "},{"$nulls":5},1,"A",null,{"v":6,"d":"6 m"},{"$f":"Calculs!$B$11","v":""},0,{"$f":"INDEX($C$6:$C$370,MATCH($M$7,$B$6:$B$370,0))","v":{"$error":"#N/A"}},{"$f":"Calculs!$B$20","v":""},0,{"$f":"INDEX($C$6:$C$370,MATCH($P$7,$B$6:$B$370,0))","v":{"$error":"#N/A"}}]
[null,{"v":6,"d":"6 m"},{"v":30,"d":"30' "},{"$nulls":5},1,"B",null,{"v":8,"d":"8 m"},"Nb Durées",{"$f":"IF(N7<$M$9,N7+1,N7)","v":0},{"$f":"INDEX($C$6:$C$370,MATCH($M$7,$B$6:$B$370,0)+N8)","v":{"$error":"#N/A"}},"Nb Durées",{"$f":"IF(Q7<$P$9,Q7+1,Q7)","v":0},{"$f":"INDEX($C$6:$C$370,MATCH($P$7,$B$6:$B$370,0)+Q8)","v":{"$error":"#N/A"}}]
[null,{"v":6,"d":"6 m"},{"v":45,"d":"45' "},{"$nulls":5},1,"C",null,{"v":10,"d":"10 m"},{"$f":"COUNTIF($B$7:$B$370,$M$7)-1","v":-1},0,{"$error":"#N/A"},{"$f":"COUNTIF($B$7:$B$370,$P$7)-1","v":-1},0,{"$error":"#N/A"}]
[null,{"v":6,"d":"6 m"},{"v":75,"d":"75' "},{"$nulls":5},1,"D",null,{"v":12,"d":"12 m"},null,0,{"$error":"#N/A"},null,0,{"$error":"#N/A"}]
[null,{"v":6,"d":"6 m"},{"v":105,"d":"105' "},{"$nulls":5},1,"E",null,{"v":15,"d":"15 m"},null,0,{"$error":"#N/A"},null,0,{"$error":"#N/A"}]
[null,{"v":6,"d":"6 m"},{"v":135,"d":"135' "},{"$nulls":5},1,"F",null,{"v":18,"d":"18 m"},null,0,{"$error":"#N/A"},null,0,{"$error":"#N/A"}]
[null,{"v":6,"d":"6 m"},{"v":180,"d":"180' "},{"$nulls":5},1,"G",null,{"v":20,"d":"20 m"},null,0,{"$error":"#N/A"},null,0,{"$error":"#N/A"}]
[null,{"v":6,"d":"6 m"},{"v":240,"d":"240' "},{"$nulls":5},1,"H",null,{"v":22,"d":"22 m"},null,0,{"$error":"#N/A"},null,0,{"$error":"#N/A"}]
[null,{"v":6,"d":"6 m"},{"v":315,"d":"315' "},{"$nulls":5},1,"I",null,{"v":25,"d":"25 m"},null,0,{"$error":"#N/A"},null,0,{"$error":"#N/A"}]
[null,{"v":6,"d":"6 m"},{"v":360,"d":"360' "},{"$nulls":5},1,"J",null,{"v":28,"d":"28 m"},null,0,{"$error":"#N/A"},null,0,{"$error":"#N/A"}]
[null,{"v":8,"d":"8 m"},{"v":15,"d":"15' "},{"$nulls":5},1,"B",null,{"v":30,"d":"30 m"},null,0,{"$error":"#N/A"},null,0,{"$error":"#N/A"}]
[null,{"v":8,"d":"8 m"},{"v":30,"d":"30' "},{"$nulls":5},1,"C",null,{"v":32,"d":"32 m"},null,0,{"$error":"#N/A"},null,0,{"$error":"#N/A"}]
[null,{"v":8,"d":"8 m"},{"v":45,"d":"45' "},{"$nulls":5},1,"D",null,{"v":35,"d":"35 m"},null,0,{"$error":"#N/A"},null,0,{"$error":"#N/A"}]
[null,{"v":8,"d":"8 m"},{"v":60,"d":"60' "},{"$nulls":5},1,"E",null,{"v":38,"d":"38 m"},null,0,{"$error":"#N/A"},null,0,{"$error":"#N/A"}]
{"$rows_left_out":363}
{"sheet":"Azote Résiduel","index":3,"n_rows":28,"n_cols":28,"rows_kept":28,"hidden":true,"merged":[[1,1,3,8],[6,3,6,4],[6,6,6,7],[10,2,10,27]]}
[]
[null,"NE PAS MODIFIER CES TABLEAUX"]
[]
[]
[]
[null,null,"GPS","Intervalle 2",null,"N2","Intervalle réel",null,null,"Type plongée II"]
[null,null,{"$f":"Calculs!$I$11","v":""},{"$f":"IF(G7=\"\",\"\",INDEX($B$12:$AB$12,MATCH(G7,$B$12:$AB$12)))","v":""},null,{"$f":"IF(OR(C7=\"\",D7=\"\"),\"\",HLOOKUP(D7,$B$12:$AB$28,MATCH($C$7,$B$12:$B$28,0)))","v":""},{"$f":"Calculs!$G$17","v":""},null,null,{"$f":"IF(AND(Données!I10=\"\",OR(Calculs!B17=\"\",_Dur2=\"\")),\"\",IF(Données!I10=\"\",\"Manque Heure Début\",IF(G7=\"Pas sorti\",\"Pas sorti\",IF($G$7<$C$12,\"( C O N S E C U T I V E )\",IF($G$7>$AB$12,\"( S I M P L E )\",\"( S U C C E S S I V E )\")))))","v":""}]
[]
[null,"TABLEAU I",null,"ÉVOLUTION   DE   L'AZOTE   RÉSIDUEL   ENTRE   DEUX   PLONGÉES"]
[]
[null,null,"INTERVALLES   DE   SURFACES"]
[null,"GPS","00:15:00","00:30:00","00:45:00","01:00:00","01:30:00","02:00:00","02:30:00","03:00:00","03:30:00","04:00:00","04:30:00","05:00:00","05:30:00","06:00:00","06:30:00","07:00:00","07:30:00","08:00:00","08:30:00","09:00:00","09:30:00","10:00:00","10:30:00","11:00:00","11:30:00","12:00:00"]
[null,"A",0.84,0.83,0.83,0.83,0.82,0.82,0.82,0.81,0.81,0.81,0.81,0.81,0.81,0.81]
[null,"B",0.88,0.88,0.87,0.86,0.85,0.85,0.84,0.83,0.83,0.82,0.82,0.82,0.81,0.81,0.81,0.81,0.81,0.81]
[null,"C",0.92,0.91,{"v":0.9,"d":"0.90"},0.89,0.88,0.87,0.85,0.85,0.84,0.83,0.83,0.82,0.82,0.82,0.81,0.81,0.81,0.81,0.81,0.81]
[null,"D",0.97,0.95,0.94,0.93,0.91,0.89,0.88,0.86,0.85,0.85,0.84,0.83,0.83,0.82,0.82,0.82,0.81,0.81,0.81,0.81,0.81,0.81]
[null,"E",{"v":1,"d":"1.00"},0.98,0.97,0.96,0.93,0.91,0.89,0.88,0.87,0.86,0.85,0.84,0.83,0.83,0.82,0.82,0.82,0.81,0.81,0.81,0.81,0.81,0.81]
[null,"F",1.05,1.03,1.01,0.99,0.96,0.94,0.91,{"v":0.9,"d":"0.90"},0.88,0.87,0.86,0.85,0.84,0.83,0.83,0.82,0.82,0.82,0.81,0.81,0.81,0.81,0.81,0.81]
[null,"G",1.08,1.06,1.04,1.02,0.98,0.96,0.93,0.91,0.89,0.88,0.87,0.85,0.85,0.84,0.83,0.83,0.82,0.82,0.82,0.81,0.81,0.81,0.81,0.81,0.81]
[null,"H",1.13,{"v":1.1,"d":"1.10"},1.08,1.05,1.01,0.98,0.95,0.93,0.91,0.89,0.88,0.86,0.85,0.85,0.84,0.83,0.83,0.82,0.82,0.82,0.81,0.81,0.81,0.81,0.81]
{"$rows_left_out":9}
{"sheet":"Majoration","index":4,"n_rows":31,"n_cols":22,"rows_kept":31,"hidden":true,"merged":[[1,1,3,8],[5,5,5,6]]}
[]
[null,"NE PAS MODIFIER CES TABLEAUX"]
[]
[]
[]
[null,"N2",null,"Prof 2",null,"Majoration",null,null,"N2"]
[null,{"$f":"IF(I7=\"\",\"\",IF(ISERROR(MATCH($I$7,B13:B31,0)),INDEX(B13:B31,MATCH($I$7,B13:B31,1)+1),INDEX(B13:B31,MATCH($I$7,B13:B31,1))))","v":""},null,{"$f":"Calculs!$B$20","v":""},null,{"$f":"IF($I$7=\"\",\"\",HLOOKUP($D$7,$B$13:$V$31,MATCH($B$7,$B$13:$B$31,0))/1440)","v":""},{"$f":"IF($I$7=\"\",0,HLOOKUP($D$7,$B$13:$V$31,MATCH($B$7,$B$13:$B$31,0)))","v":0},null,{"$f":"IF('Azote Résiduel'!$F$7<0.82,0.82,'Azote Résiduel'!$F$7)","v":""}]
[]
[]
[null,"TABLEAU II",null,"DÉTERMINATION   DE   LA   MAJORATION   EN   MINUTES"]
[]
[null,"Azote résiduel     PROFONDEUR   DE   LA   DEUXIÈME   PLONGÉE"]
[null,"N2",{"v":12,"d":"12 m"},{"v":15,"d":"15 m"},{"v":18,"d":"18 m"},{"v":20,"d":"20 m"},{"v":22,"d":"22 m"},{"v":25,"d":"25 m"},{"v":28,"d":"28 m"},{"v":30,"d":"30 m"},{"v":32,"d":"32 m"},{"v":35,"d":"35 m"},{"v":38,"d":"38 m"},{"v":40,"d":"40 m"},{"v":42,"d":"42 m"},{"v":45,"d":"45 m"},{"v":48,"d":"48 m"},{"v":50,"d":"50 m"},{"v":52,"d":"52 m"},{"v":55,"d":"55 m"},{"v":58,"d":"58 m"},{"v":60,"d":"60 m"}]
[null,0.82,4,3,2,2,2,2,2,1,1,1,1,1,1,1,1,1,1,1,1,1]
[null,0.84,7,6,5,4,4,3,3,3,3,2,2,2,2,2,2,2,2,2,1,1]
[null,0.86,11,9,7,7,6,5,5,4,4,4,3,3,3,3,3,3,3,2,2,2]
[null,0.89,17,13,11,10,9,8,7,7,6,6,5,5,5,4,4,4,4,4,3,3]
[null,0.92,23,18,15,13,12,11,10,9,8,8,7,7,6,6,5,5,5,5,5,4]
[null,0.95,29,23,19,17,15,13,12,11,10,10,9,8,8,7,7,7,6,6,6,5]
[null,0.99,38,30,24,22,20,17,15,14,13,12,11,11,10,9,9,8,8,8,7,7]
{"$rows_left_out":12}
{"sheet":"Oxygene","index":5,"n_rows":26,"n_cols":17,"rows_kept":26,"hidden":true,"merged":[[1,1,3,8]]}
[]
[null,"NE PAS MODIFIER CES TABLEAUX"]
[]
[]
[]
[null,"TABLEAU III"]
[null,"DIMINUTION   DE   L'AZOTE   RÉSIDUEL   PAR   INHALATION   D'OXYGÈNE   PUR   EN   SURFACE"]
[]
[null,"Groupe de Plongées Successives     Équivalent Azote Résiduel     DURÉE   DE   L'INHALATION   D'OXYGÈNE"]
[null,null,"15min","30 min","45min","1h00","1h15","1h30","1h45","2h00","2h15","2h30","2h45","3h00","3h15","3h30"]
[null,"A",0.84,{"v":0.8,"d":"0.80"}]
[null,"B",0.89,0.85,0.82,0.79]
[null,"C",0.93,0.89,0.85,0.82,0.79]
[null,"D",0.98,0.94,{"v":0.9,"d":"0.90"},0.86,0.82,{"v":0.8,"d":"0.80"}]
[null,"E",1.02,0.98,0.94,{"v":0.9,"d":"0.90"},0.86,0.82,{"v":0.8,"d":"0.80"}]
[null,"F",1.07,1.02,0.98,0.94,{"v":0.9,"d":"0.90"},0.86,0.82,{"v":0.8,"d":"0.80"}]
[null,"G",1.11,1.06,1.02,0.97,0.93,{"v":0.9,"d":"0.90"},0.86,0.82,{"v":0.8,"d":"0.80"}]
[null,"H",1.16,1.11,1.06,1.02,0.97,0.93,0.89,0.86,0.82,{"v":0.8,"d":"0.80"}]
[null,"I",{"v":1.2,"d":"1.20"},1.15,{"v":1.1,"d":"1.10"},1.05,1.01,0.97,0.93,0.89,0.85,0.81,{"v":0.8,"d":"0.80"}]
[null,"J",1.24,1.19,1.14,1.09,1.04,{"v":1,"d":"1.00"},0.96,0.92,0.89,0.86,0.81,0.79]
{"$rows_left_out":7}
{"sheet":"Remontée","index":6,"n_rows":20,"n_cols":27,"rows_kept":20,"hidden":true,"merged":[[1,1,3,7]]}
[]
[null,"NE PAS MODIFIER CES TABLEAUX"]
[]
[]
[]
[null,"Premier Palier","Prof","Ligne","Durée R"]
[null,{"$f":"IF(Calculs!$D$11<>\"\",Calculs!$D$10,IF(Calculs!$E$11<>\"\",Calculs!$E$10,IF(Calculs!$F$11<>\"\",Calculs!$F$10,IF(Calculs!$G$11<>\"\",Calculs!$G$10,IF(Calculs!$H$11<>\"\",Calculs!$H$10,\"Sans palier\")))))","v":"Sans palier"},{"$f":"Calculs!$B$11","v":""},{"$f":"MATCH($B$7,$B$14:$B$20,0)","v":2},{"$f":"HLOOKUP($C$7,$B$14:$AA$20,D7)/1440","v":{"$error":"#N/A"}}]
[]
[null,"Premier Palier","Prof","Ligne","Durée R"]
[null,{"$f":"IF(Calculs!$F$20<>\"\",Calculs!$F$19,IF(Calculs!$G$20<>\"\",Calculs!$G$19,IF(Calculs!$H$20<>\"\",Calculs!$H$19,IF(Calculs!$I$20<>\"\",Calculs!$I$19,IF(Calculs!$J$20<>\"\",Calculs!$J$19,\"Sans palier\")))))","v":"Sans palier"},{"$f":"Calculs!$B$20","v":""},{"$f":"MATCH($B$10,$B$14:$B$20,0)","v":2},{"$f":"HLOOKUP($C$10,$B$14:$AA$20,D10)/1440","v":{"$error":"#N/A"}}]
[]
[null,"TABLEAU IV","DURÉE   DE   REMONTÉE   JUSQU'AU   PREMIER   PALIER   PLUS   TEMPS   INTER PALIERS"]
[]
[null,"Premier Palier",{"v":6,"d":"6 m"},{"v":8,"d":"8 m"},{"v":10,"d":"10 m"},{"v":12,"d":"12 m"},{"v":15,"d":"15 m"},{"v":18,"d":"18 m"},{"v":20,"d":"20 m"},{"v":22,"d":"22 m"},{"v":25,"d":"25 m"},{"v":28,"d":"28 m"},{"v":30,"d":"30 m"},{"v":32,"d":"32 m"},{"v":35,"d":"35 m"},{"v":38,"d":"38 m"},{"v":40,"d":"40 m"},{"v":42,"d":"42 m"},{"v":45,"d":"45 m"},{"v":48,"d":"48 m"},{"v":50,"d":"50 m"},{"v":52,"d":"52 m"},{"v":55,"d":"55 m"},{"v":58,"d":"58 m"},{"v":60,"d":"60 m"},{"v":62,"d":"62 m"},{"v":65,"d":"65 m"}]
[null,"Sans palier",1,1,1,1,1,2,2,2,2,2,2,3,3,3,3,3,3,4,4,4,4,4,4,5,5]
[null,"3 m",1,1,1,2,2,2,2,2,2,3,3,3,3,3,3,4,4,4,4,4,4,5,5,5,5]
[null,"6 m",1,2,2,2,2,2,2,3,3,3,3,3,3,4,4,4,4,4,4,5,5,5,5,5,5]
[null,"9 m",null,null,2,2,2,3,3,3,3,3,3,4,4,4,4,4,4,5,5,5,5,5,5,6,6]
[null,"12 m",{"$nulls":3},2,3,3,3,3,3,4,4,4,4,4,4,4,5,5,5,5,5,6,6,6,6]
[null,"15 m",{"$nulls":4},3,3,3,3,4,4,4,4,4,5,5,5,5,5,5,5,6,6,6,6,6]